Reaction Details
TargetHistone deacetylase 1
LigandBDBM50398716
Substrate/Competitorn/a
Meas. Tech.ChEMBL_875959 (CHEMBL2188465)
IC50 3020±n/a nM
Citation Bergman, JAWoan, KPerez-Villarroel, PVillagra, ASotomayor, EMKozikowski, AP Selective histone deacetylase 6 inhibitors bearing substituted urea linkers inhibit melanoma cell growth. J Med Chem55:9891-9 (2012) 
 
Histone deacetylase 1
Name:Histone deacetylase 1
Type:Enzyme
Mol. Mass.:55090.27
Organism:Homo sapiens (Human)
Description:Q13547
Residue:482
BDBM50398716
NameBDBM50398716
Synonyms:CHEMBL2179618 US9409858, 5g US9956192, Compound 5g
TypeSmall organic molecule
Emp. Form.C19H23N3O3
Mol. Mass.341.4042
SMILESCCCCN(Cc1ccc(cc1)C(=O)NO)C(=O)Nc1ccccc1