Reaction Details
TargetHistone deacetylase 1
LigandBDBM50398723
Substrate/Competitorn/a
Meas. Tech.ChEMBL_875959 (CHEMBL2188465)
IC50 1690±n/a nM
Citation Bergman, JAWoan, KPerez-Villarroel, PVillagra, ASotomayor, EMKozikowski, AP Selective histone deacetylase 6 inhibitors bearing substituted urea linkers inhibit melanoma cell growth. J Med Chem55:9891-9 (2012) 
 
Histone deacetylase 1
Name:Histone deacetylase 1
Type:Enzyme
Mol. Mass.:55090.27
Organism:Homo sapiens (Human)
Description:Q13547
Residue:482
BDBM50398723
NameBDBM50398723
Synonyms:CHEMBL2179615 US9409858, 5d US9956192, Compound 5d
TypeSmall organic molecule
Emp. Form.C24H25N3O5
Mol. Mass.435.4724
SMILESCOc1ccccc1NC(=O)N(CCc1ccc(O)cc1)Cc1ccc(cc1)C(=O)NO