Reaction Details
TargetMu-type opioid receptor
LigandBDBM50398754
Substrate/Competitorn/a
Meas. Tech.ChEMBL_876436 (CHEMBL2186797)
EC50 301±n/a nM
Citation Ananthan, SSaini, SKDersch, CMXu, HMcGlinchey, NGiuvelis, DBilsky, EJRothman, RB 14-Alkoxy- and 14-acyloxypyridomorphinans:µ agonist/d antagonist opioid analgesics with diminished tolerance and dependence side effects. J Med Chem55:8350-63 (2012) 
 
Mu-type opioid receptor
Name:Mu-type opioid receptor
Type:G Protein-Coupled Receptor (GPCR)
Mol. Mass.:44789.51
Organism:Homo sapiens (Human)
Description:P35372
Residue:400
BDBM50398754
NameBDBM50398754
Synonyms:CHEMBL2179654
TypeSmall organic molecule
Emp. Form.C33H29ClN2O3
Mol. Mass.537.048
SMILESCN1CC[C@@]23[C@H]4Oc5c2c(C[C@@H]1[C@@]3(Cc1cc(cnc41)-c1ccc(Cl)cc1)OCc1ccccc1)ccc5O