Reaction Details
TargetMu-type opioid receptor
LigandBDBM50398755
Substrate/Competitorn/a
Meas. Tech.ChEMBL_876436 (CHEMBL2186797)
EC50 379±n/a nM
Citation Ananthan, SSaini, SKDersch, CMXu, HMcGlinchey, NGiuvelis, DBilsky, EJRothman, RB 14-Alkoxy- and 14-acyloxypyridomorphinans:µ agonist/d antagonist opioid analgesics with diminished tolerance and dependence side effects. J Med Chem55:8350-63 (2012) 
 
Mu-type opioid receptor
Name:Mu-type opioid receptor
Type:G Protein-Coupled Receptor (GPCR)
Mol. Mass.:44789.51
Organism:Homo sapiens (Human)
Description:P35372
Residue:400
BDBM50398755
NameBDBM50398755
Synonyms:CHEMBL2179653
TypeSmall organic molecule
Emp. Form.C27H25ClN2O3
Mol. Mass.460.952
SMILESCO[C@]12Cc3cc(cnc3[C@@H]3Oc4c5c(C[C@H]1N(C)CC[C@@]235)ccc4O)-c1ccc(Cl)cc1