Reaction Details
TargetKappa-type opioid receptor
LigandBDBM50398754
Substrate/Competitorn/a
Meas. Tech.ChEMBL_876434 (CHEMBL2186795)
EC50 215±n/a nM
Citation Ananthan, SSaini, SKDersch, CMXu, HMcGlinchey, NGiuvelis, DBilsky, EJRothman, RB 14-Alkoxy- and 14-acyloxypyridomorphinans:µ agonist/d antagonist opioid analgesics with diminished tolerance and dependence side effects. J Med Chem55:8350-63 (2012) 
 
Kappa-type opioid receptor
Name:Kappa-type opioid receptor
Type:G Protein-Coupled Receptor (GPCR)
Mol. Mass.:42648.76
Organism:Homo sapiens (Human)
Description:P41145
Residue:380
BDBM50398754
NameBDBM50398754
Synonyms:CHEMBL2179654
TypeSmall organic molecule
Emp. Form.C33H29ClN2O3
Mol. Mass.537.048
SMILESCN1CC[C@@]23[C@H]4Oc5c2c(C[C@@H]1[C@@]3(Cc1cc(cnc41)-c1ccc(Cl)cc1)OCc1ccccc1)ccc5O