Reaction Details
TargetHigh affinity cGMP-specific 3',5'-cyclic phosphodiesterase 9A
LigandBDBM50398792
Substrate/Competitorn/a
Meas. Tech.ChEMBL_873311 (CHEMBL2185164)
IC50 230±n/a nM
Citation Claffey, MMHelal, CJVerhoest, PRKang, ZFors, KSJung, SZhong, JBundesmann, MWHou, XLui, SKleiman, RJVanase-Frawley, MSchmidt, AWMenniti, FSchmidt, CJHoffman, WEHajos, MMcDowell, LO'Connor, REMacdougall-Murphy, MFonseca, KRBecker, SLNelson, FRLiras, S Application of structure-based drug design and parallel chemistry to identify selective, brain penetrant, in vivo active phosphodiesterase 9A inhibitors. J Med Chem55:9055-68 (2012) 
 
High affinity cGMP-specific 3',5'-cyclic phosphodiesterase 9A
Name:High affinity cGMP-specific 3',5'-cyclic phosphodiesterase 9A
Type:Protein
Mol. Mass.:68488.40
Organism:Homo sapiens (Human)
Description:O76083
Residue:593
BDBM50398792
NameBDBM50398792
Synonyms:CHEMBL2177503
TypeSmall organic molecule
Emp. Form.C22H27N5O
Mol. Mass.377.4827
SMILESC[C@@H](N1CCC(C1)c1ccccc1)c1nc2n(ncc2c(=O)[nH]1)C1CCCC1