Reaction Details
TargetDual specificity calcium/calmodulin-dependent 3',5'-cyclic nucleotide phosphodiesterase 1C
LigandBDBM50398800
Substrate/Competitorn/a
Meas. Tech.ChEMBL_873308 (CHEMBL2185161)
IC50>1000±n/a nM
Citation Claffey, MMHelal, CJVerhoest, PRKang, ZFors, KSJung, SZhong, JBundesmann, MWHou, XLui, SKleiman, RJVanase-Frawley, MSchmidt, AWMenniti, FSchmidt, CJHoffman, WEHajos, MMcDowell, LO'Connor, REMacdougall-Murphy, MFonseca, KRBecker, SLNelson, FRLiras, S Application of structure-based drug design and parallel chemistry to identify selective, brain penetrant, in vivo active phosphodiesterase 9A inhibitors. J Med Chem55:9055-68 (2012) 
 
Dual specificity calcium/calmodulin-dependent 3',5'-cyclic nucleotide phosphodiesterase 1C
Name:Dual specificity calcium/calmodulin-dependent 3',5'-cyclic nucleotide phosphodiesterase 1C
Type:Enzyme
Mol. Mass.:80778.58
Organism:Homo sapiens (Human)
Description:Q14123
Residue:709
BDBM50398800
NameBDBM50398800
Synonyms:CHEMBL2180069
TypeSmall organic molecule
Emp. Form.C19H23N7O3
Mol. Mass.397.431
SMILESC[C@@H](N1CC(C1)Oc1ncccn1)c1nc2n(ncc2c(=O)[nH]1)C1CCOCC1