Reaction Details
TargetSodium-dependent dopamine transporter
LigandBDBM50398804
Substrate/Competitorn/a
Meas. Tech.ChEMBL_873289 (CHEMBL2184716)
Ki>10000±n/a nM
Citation Claffey, MMHelal, CJVerhoest, PRKang, ZFors, KSJung, SZhong, JBundesmann, MWHou, XLui, SKleiman, RJVanase-Frawley, MSchmidt, AWMenniti, FSchmidt, CJHoffman, WEHajos, MMcDowell, LO'Connor, REMacdougall-Murphy, MFonseca, KRBecker, SLNelson, FRLiras, S Application of structure-based drug design and parallel chemistry to identify selective, brain penetrant, in vivo active phosphodiesterase 9A inhibitors. J Med Chem55:9055-68 (2012) 
 
Sodium-dependent dopamine transporter
Name:Sodium-dependent dopamine transporter
Type:Multi-pass membrane protein
Mol. Mass.:68497.11
Organism:Homo sapiens (Human)
Description:Q01959
Residue:620
BDBM50398804
NameBDBM50398804
Synonyms:CHEMBL2177497
TypeSmall organic molecule
Emp. Form.C22H24N6O3
Mol. Mass.420.4644
SMILESCC(N1CC(C1)Oc1ccc(cc1)C#N)c1nc2n(ncc2c(=O)[nH]1)C1CCOCC1