Reaction Details
TargetGlutamate carboxypeptidase 2
LigandBDBM17659
Substrate/Competitorn/a
Meas. Tech.ChEMBL_873320 (CHEMBL2185173)
Ki 0.4±n/a nM
Citation Graham, KLesche, RGromov, AVBöhnke, NSchäfer, MHassfeld, JDinkelborg, LKettschau, G Radiofluorinated derivatives of 2-(phosphonomethyl)pentanedioic acid as inhibitors of prostate specific membrane antigen (PSMA) for the imaging of prostate cancer. J Med Chem55:9510-20 (2012) 
 
Glutamate carboxypeptidase 2
Name:Glutamate carboxypeptidase 2
Type:PROTEIN
Mol. Mass.:84333.66
Organism:Homo sapiens (Human)
Description:ChEMBL_1497035
Residue:750
BDBM17659
NameBDBM17659
Synonyms:(R,S)-2-phosphonomethylpentanedioic acid 2-PMPA US10894807, ID P009 | pentanedioic acid analogue, (RS)-1
TypeSmall organic molecule
Emp. Form.C6H11O7P
Mol. Mass.226.1211
SMILESOC(=O)CCC(CP(O)(O)=O)C(O)=O