Reaction Details
TargetGlutamate carboxypeptidase 2
LigandBDBM50398811
Substrate/Competitorn/a
Meas. Tech.ChEMBL_873320 (CHEMBL2185173)
IC50 3.1±n/a nM
Citation Graham, KLesche, RGromov, AVBöhnke, NSchäfer, MHassfeld, JDinkelborg, LKettschau, G Radiofluorinated derivatives of 2-(phosphonomethyl)pentanedioic acid as inhibitors of prostate specific membrane antigen (PSMA) for the imaging of prostate cancer. J Med Chem55:9510-20 (2012) 
 
Glutamate carboxypeptidase 2
Name:Glutamate carboxypeptidase 2
Type:PROTEIN
Mol. Mass.:84333.66
Organism:Homo sapiens (Human)
Description:ChEMBL_1497035
Residue:750
BDBM50398811
NameBDBM50398811
Synonyms:CHEMBL2177507
TypeSmall organic molecule
Emp. Form.C6H10FO7P
Mol. Mass.244.1116
SMILESOC(=O)[C@@H](F)C[C@H](CP(O)(O)=O)C(O)=O