Reaction Details
TargetGlutamate carboxypeptidase 2
LigandBDBM50246899
Substrate/Competitorn/a
Meas. Tech.ChEMBL_873321 (CHEMBL2185174)
Ki 0.01±n/a nM
Citation Graham, KLesche, RGromov, AVBöhnke, NSchäfer, MHassfeld, JDinkelborg, LKettschau, G Radiofluorinated derivatives of 2-(phosphonomethyl)pentanedioic acid as inhibitors of prostate specific membrane antigen (PSMA) for the imaging of prostate cancer. J Med Chem55:9510-20 (2012) 
 
Glutamate carboxypeptidase 2
Name:Glutamate carboxypeptidase 2
Type:PROTEIN
Mol. Mass.:84333.66
Organism:Homo sapiens (Human)
Description:ChEMBL_1497035
Residue:750
BDBM50246899
NameBDBM50246899
Synonyms:(S)-2-(3-((S)-1-carboxy-5-(4-iodobenzamido)pentyl)ureido)pentanedioic acid N-{[(1S)-1-carboxy-5-{[(4-iodophenyl)carbonyl]amino}pentyl]carbamoyl}-L-glutamic acid
TypeSmall organic molecule
Emp. Form.C19H24IN3O8
Mol. Mass.549.3136
SMILESOC(=O)CC[C@H](NC(=O)N[C@@H](CCCCNC(=O)c1ccc(I)cc1)C(O)=O)C(O)=O