Reaction Details
TargetGlutamate carboxypeptidase 2
LigandBDBM50304722
Substrate/Competitorn/a
Meas. Tech.ChEMBL_873321 (CHEMBL2185174)
Ki 5.3±n/a nM
Citation Graham, KLesche, RGromov, AVBöhnke, NSchäfer, MHassfeld, JDinkelborg, LKettschau, G Radiofluorinated derivatives of 2-(phosphonomethyl)pentanedioic acid as inhibitors of prostate specific membrane antigen (PSMA) for the imaging of prostate cancer. J Med Chem55:9510-20 (2012) 
 
Glutamate carboxypeptidase 2
Name:Glutamate carboxypeptidase 2
Type:PROTEIN
Mol. Mass.:84333.66
Organism:Homo sapiens (Human)
Description:ChEMBL_1497035
Residue:750
BDBM50304722
NameBDBM50304722
Synonyms:(S)-2-(3-((S)-1-Carboxybut-3-ynyl)ureido)-6-(4-iodobenzamido)hexanoic acid | CHEMBL595408
TypeSmall organic molecule
Emp. Form.C19H22IN3O6
Mol. Mass.515.299
SMILESOC(=O)[C@H](CCCCNC(=O)c1ccc(I)cc1)NC(=O)N[C@@H](CC#C)C(O)=O