Reaction Details
TargetGlutamate carboxypeptidase 2
LigandBDBM50304751
Substrate/Competitorn/a
Meas. Tech.ChEMBL_873321 (CHEMBL2185174)
Ki 11±n/a nM
Citation Graham, KLesche, RGromov, AVBöhnke, NSchäfer, MHassfeld, JDinkelborg, LKettschau, G Radiofluorinated derivatives of 2-(phosphonomethyl)pentanedioic acid as inhibitors of prostate specific membrane antigen (PSMA) for the imaging of prostate cancer. J Med Chem55:9510-20 (2012) 
 
Glutamate carboxypeptidase 2
Name:Glutamate carboxypeptidase 2
Type:PROTEIN
Mol. Mass.:84333.66
Organism:Homo sapiens (Human)
Description:ChEMBL_1497035
Residue:750
BDBM50304751
NameBDBM50304751
Synonyms:(S)-2-(3-((S)-1-Carboxybut-3-enyl)ureido)-6-(4-iodobenzamido)hexanoic acid N~2~-{[(1S)-1-carboxybut-3-en-1-yl]carbamoyl}-N~6~-[(4-iodophenyl)carbonyl]-L-lysine
TypeSmall organic molecule
Emp. Form.C19H24IN3O6
Mol. Mass.517.3148
SMILESOC(=O)[C@H](CCCCNC(=O)c1ccc(I)cc1)NC(=O)N[C@@H](CC=C)C(O)=O