Reaction Details
TargetGlutamate carboxypeptidase 2
LigandBDBM50102258
Substrate/Competitorn/a
Meas. Tech.ChEMBL_873321 (CHEMBL2185174)
Ki 8±n/a nM
Citation Graham, KLesche, RGromov, AVBöhnke, NSchäfer, MHassfeld, JDinkelborg, LKettschau, G Radiofluorinated derivatives of 2-(phosphonomethyl)pentanedioic acid as inhibitors of prostate specific membrane antigen (PSMA) for the imaging of prostate cancer. J Med Chem55:9510-20 (2012) 
 
Glutamate carboxypeptidase 2
Name:Glutamate carboxypeptidase 2
Type:PROTEIN
Mol. Mass.:84333.66
Organism:Homo sapiens (Human)
Description:ChEMBL_1497035
Residue:750
BDBM50102258
NameBDBM50102258
Synonyms:(S)-2-[3-((S)-3-Carboxy-1-carboxy-propyl)-ureido]-pentanedioic acid CHEMBL46005
TypeSmall organic molecule
Emp. Form.C11H16N2O9
Mol. Mass.320.2527
SMILESOC(=O)CC[C@H](NC(=O)N[C@@H](CCC(O)=O)C(O)=O)C(O)=O