Reaction Details
TargetGlutamate carboxypeptidase 2
LigandBDBM50048693
Substrate/Competitorn/a
Meas. Tech.ChEMBL_873321 (CHEMBL2185174)
Ki 700±n/a nM
Citation Graham, KLesche, RGromov, AVBöhnke, NSchäfer, MHassfeld, JDinkelborg, LKettschau, G Radiofluorinated derivatives of 2-(phosphonomethyl)pentanedioic acid as inhibitors of prostate specific membrane antigen (PSMA) for the imaging of prostate cancer. J Med Chem55:9510-20 (2012) 
 
Glutamate carboxypeptidase 2
Name:Glutamate carboxypeptidase 2
Type:PROTEIN
Mol. Mass.:84333.66
Organism:Homo sapiens (Human)
Description:ChEMBL_1497035
Residue:750
BDBM50048693
NameBDBM50048693
Synonyms:2-Phosphonomethyl-succinic acid CHEMBL132183
TypeSmall organic molecule
Emp. Form.C5H9O7P
Mol. Mass.212.0945
SMILESOC(=O)CC(CP(O)(O)=O)C(O)=O