Reaction Details
TargetBeta-secretase 1
LigandBDBM50398871
Substrate/Competitorn/a
Meas. Tech.ChEMBL_873596 (CHEMBL2187885)
IC50 90±n/a nM
Citation Gerritz, SWZhai, WShi, SZhu, SToyn, JHMeredith, JEIben, LGBurton, CRAlbright, CFGood, ACTebben, AJMuckelbauer, JKCamac, DMMetzler, WCook, LSPadmanabha, RLentz, KASofia, MJPoss, MAMacor, JEThompson, LA Acyl guanidine inhibitors ofß-secretase (BACE-1): optimization of a micromolar hit to a nanomolar lead via iterative solid- and solution-phase library synthesis. J Med Chem55:9208-23 (2012) 
 
Beta-secretase 1
Name:Beta-secretase 1
Type:Protein
Mol. Mass.:55755.10
Organism:Homo sapiens (Human)
Description:P56817
Residue:501
BDBM50398871
NameBDBM50398871
Synonyms:CHEMBL2178192
TypeSmall organic molecule
Emp. Form.C25H29ClN6O4
Mol. Mass.512.989
SMILESCOc1ccc(cc1)-c1noc(C)c1C(=O)NC(N)=NCc1cc(C)c(NC(=O)CN(C)C)c(Cl)c1