Reaction Details
TargetBeta-secretase 1
LigandBDBM50398864
Substrate/Competitorn/a
Meas. Tech.ChEMBL_873574 (CHEMBL2187491)
IC50 180±n/a nM
Citation Gerritz, SWZhai, WShi, SZhu, SToyn, JHMeredith, JEIben, LGBurton, CRAlbright, CFGood, ACTebben, AJMuckelbauer, JKCamac, DMMetzler, WCook, LSPadmanabha, RLentz, KASofia, MJPoss, MAMacor, JEThompson, LA Acyl guanidine inhibitors ofß-secretase (BACE-1): optimization of a micromolar hit to a nanomolar lead via iterative solid- and solution-phase library synthesis. J Med Chem55:9208-23 (2012) 
 
Beta-secretase 1
Name:Beta-secretase 1
Type:Protein
Mol. Mass.:55755.10
Organism:Homo sapiens (Human)
Description:P56817
Residue:501
BDBM50398864
NameBDBM50398864
Synonyms:CHEMBL2178164
TypeSmall organic molecule
Emp. Form.C25H26Cl2N6O3S
Mol. Mass.561.483
SMILESCOc1ccc(cc1)-c1nsc(C)c1C(=O)NC(N)=NCc1cc(Cl)c(NC(=O)CN2CCC2)c(Cl)c1