Reaction Details
TargetGlutamate receptor ionotropic, NMDA 2B
LigandBDBM10404
Substrate/Competitorn/a
Meas. Tech.ChEMBL_874795 (CHEMBL2188839)
Ki>100000±n/a nM
Citation Simoni, EDaniele, SBottegoni, GPizzirani, DTrincavelli, MLGoldoni, LTarozzo, GReggiani, AMartini, CPiomelli, DMelchiorre, CRosini, MCavalli, A Combining galantamine and memantine in multitargeted, new chemical entities potentially useful in Alzheimer's disease. J Med Chem55:9708-21 (2012) 
 
Glutamate receptor ionotropic, NMDA 2B
Name:Glutamate receptor ionotropic, NMDA 2B
Type:Protein
Mol. Mass.:166077.66
Organism:Rattus norvegicus (Rat)
Description:Q00960
Residue:1482
BDBM10404
NameBDBM10404
Synonyms:(1S,12S,14R)-9-methoxy-4-methyl-11-oxa-4-azatetracyclo[8.6.1.0^{1,12}.0^{6,17}]heptadeca-6,8,10(17),15-tetraen-14-ol GALANTAMINE HYDROBROMIDE Galanthamine Lycoremine Nivaline Reminyl US9586925, Galantamine | galantamine
TypeSmall organic molecule
Emp. Form.C17H21NO3
Mol. Mass.287.3535
SMILESCOc1ccc2CN(C)CC[C@@]34C=C[C@H](O)C[C@@H]3Oc1c24