Reaction Details
TargetEstrogen receptor
LigandBDBM50398932
Substrate/Competitorn/a
Meas. Tech.ChEMBL_874806 (CHEMBL2188850)
EC50 0.12±n/a nM
Citation Schäfer, AWellner, AStrauss, MSchäfer, AWolber, GGust, R Influence of chlorine or fluorine substitution on the estrogenic properties of 1-alkyl-2,3,5-tris(4-hydroxyphenyl)-1H-pyrroles. J Med Chem55:9607-18 (2012) 
 
Estrogen receptor
Name:Estrogen receptor
Type:Protein
Mol. Mass.:66230.44
Organism:Homo sapiens (Human)
Description:P03372
Residue:595
BDBM50398932
NameBDBM50398932
Synonyms:CHEMBL2178797
TypeSmall organic molecule
Emp. Form.C25H22FNO3
Mol. Mass.403.4455
SMILESCCCn1c(cc(c1-c1ccc(O)cc1F)-c1ccc(O)cc1)-c1ccc(O)cc1