Reaction Details
TargetEstrogen receptor
LigandBDBM50398934
Substrate/Competitorn/a
Meas. Tech.ChEMBL_874806 (CHEMBL2188850)
EC50 0.4±n/a nM
Citation Schäfer, AWellner, AStrauss, MSchäfer, AWolber, GGust, R Influence of chlorine or fluorine substitution on the estrogenic properties of 1-alkyl-2,3,5-tris(4-hydroxyphenyl)-1H-pyrroles. J Med Chem55:9607-18 (2012) 
 
Estrogen receptor
Name:Estrogen receptor
Type:Protein
Mol. Mass.:66230.44
Organism:Homo sapiens (Human)
Description:P03372
Residue:595
BDBM50398934
NameBDBM50398934
Synonyms:CHEMBL2178795
TypeSmall organic molecule
Emp. Form.C25H23NO3
Mol. Mass.385.455
SMILESCCCn1c(cc(c1-c1ccc(O)cc1)-c1ccc(O)cc1)-c1ccc(O)cc1