Reaction Details
TargetKappa-type opioid receptor
LigandBDBM50398949
Substrate/Competitorn/a
Meas. Tech.ChEMBL_875493 (CHEMBL2183134)
Ki 1.9±n/a nM
Citation Moynihan, HADerrick, IBroadbear, JHGreedy, BMAceto, MDHarris, LSPurington, LCThomas, MPWoods, JHTraynor, JRHusbands, SMLewis, JW Fumaroylamino-4,5-epoxymorphinans and related opioids with irreversibleµ opioid receptor antagonist effects. J Med Chem55:9868-74 (2012) 
 
Kappa-type opioid receptor
Name:Kappa-type opioid receptor
Type:G Protein-Coupled Receptor (GPCR)
Mol. Mass.:42744.99
Organism:Cavia porcellus (domestic guinea pig)
Description:P41144
Residue:380
BDBM50398949
NameBDBM50398949
Synonyms:CHEMBL2179260
TypeSmall organic molecule
Emp. Form.C28H34N2O6
Mol. Mass.494.5794
SMILESCOC(=O)\C=C\C(=O)N[C@H]1C[C@]23CC[C@]1(OC)[C@@H]1Oc4c5c(C[C@H]2N(CC2CC2)CC[C@@]315)ccc4O