Reaction Details
TargetMu-type opioid receptor
LigandBDBM50398948
Substrate/Competitorn/a
Meas. Tech.ChEMBL_875495 (CHEMBL2183136)
Ki 0.9±n/a nM
Citation Moynihan, HADerrick, IBroadbear, JHGreedy, BMAceto, MDHarris, LSPurington, LCThomas, MPWoods, JHTraynor, JRHusbands, SMLewis, JW Fumaroylamino-4,5-epoxymorphinans and related opioids with irreversibleµ opioid receptor antagonist effects. J Med Chem55:9868-74 (2012) 
 
Mu-type opioid receptor
Name:Mu-type opioid receptor
Type:Enzyme Catalytic Domain
Mol. Mass.:11165.58
Organism:GUINEA PIG
Description:P97266
Residue:98
BDBM50398948
NameBDBM50398948
Synonyms:CHEMBL2179261
TypeSmall organic molecule
Emp. Form.C29H36N2O6
Mol. Mass.508.6059
SMILESCOC(=O)\C=C\C(=O)NC[C@H]1C[C@]23CC[C@]1(OC)[C@@H]1Oc4c5c(C[C@H]2N(CC2CC2)CC[C@@]315)ccc4O