Reaction Details
TargetMu-type opioid receptor
LigandBDBM50398952
Substrate/Competitorn/a
Meas. Tech.ChEMBL_875495 (CHEMBL2183136)
Ki 0.24±n/a nM
Citation Moynihan, HADerrick, IBroadbear, JHGreedy, BMAceto, MDHarris, LSPurington, LCThomas, MPWoods, JHTraynor, JRHusbands, SMLewis, JW Fumaroylamino-4,5-epoxymorphinans and related opioids with irreversibleµ opioid receptor antagonist effects. J Med Chem55:9868-74 (2012) 
 
Mu-type opioid receptor
Name:Mu-type opioid receptor
Type:Enzyme Catalytic Domain
Mol. Mass.:11165.58
Organism:GUINEA PIG
Description:P97266
Residue:98
BDBM50398952
NameBDBM50398952
Synonyms:CHEMBL2179264
TypeSmall organic molecule
Emp. Form.C25H28N2O6
Mol. Mass.452.4996
SMILESCOC(=O)\C=C\C(=O)N[C@]12CCC(=O)[C@@H]3Oc4c5c(C[C@H]1N(CC1CC1)CC[C@@]235)ccc4O