Reaction Details
Target5-hydroxytryptamine receptor 4
LigandBDBM50398970
Substrate/Competitorn/a
Meas. Tech.ChEMBL_875039 (CHEMBL2184357)
Ki 200±n/a nM
Citation Furlotti, GAlisi, MAApicella, CCapezzone de Joannon, ACazzolla, NCosti, RCuzzucoli Crucitti, GGarrone, BIacovo, AMagarò, GMangano, GMiele, GOmbrato, RPescatori, LPolenzani, LRosi, FVitiello, MDi Santo, R Discovery and pharmacological profile of new 1H-indazole-3-carboxamide and 2H-pyrrolo[3,4-c]quinoline derivatives as selective serotonin 4 receptor ligands. J Med Chem55:9446-66 (2012) 
 
5-hydroxytryptamine receptor 4
Name:5-hydroxytryptamine receptor 4
Type:Enzyme
Mol. Mass.:43767.54
Organism:Homo sapiens (Human)
Description:Q13639
Residue:388
BDBM50398970
NameBDBM50398970
Synonyms:CHEMBL2179673
TypeSmall organic molecule
Emp. Form.C27H29N3O3
Mol. Mass.443.5375
SMILESCn1cc2c(OCC3CCN(CCc4ccccc4C(O)=O)CC3)nc3ccccc3c2c1