Reaction Details
Target5-hydroxytryptamine receptor 2A
LigandBDBM50398985
Substrate/Competitorn/a
Meas. Tech.ChEMBL_875037 (CHEMBL2184355)
Ki 31.62±n/a nM
Citation Furlotti, GAlisi, MAApicella, CCapezzone de Joannon, ACazzolla, NCosti, RCuzzucoli Crucitti, GGarrone, BIacovo, AMagarò, GMangano, GMiele, GOmbrato, RPescatori, LPolenzani, LRosi, FVitiello, MDi Santo, R Discovery and pharmacological profile of new 1H-indazole-3-carboxamide and 2H-pyrrolo[3,4-c]quinoline derivatives as selective serotonin 4 receptor ligands. J Med Chem55:9446-66 (2012) 
 
5-hydroxytryptamine receptor 2A
Name:5-hydroxytryptamine receptor 2A
Type:undefined
Mol. Mass.:52607.65
Organism:Homo sapiens (Human)
Description:P28223
Residue:471
BDBM50398985
NameBDBM50398985
Synonyms:CHEMBL2177130
TypeSmall organic molecule
Emp. Form.C25H32N4O
Mol. Mass.404.5478
SMILESCC(C)n1nc(C(=O)NCC2CCN(CCc3ccccc3)CC2)c2ccccc12