Reaction Details
Target5-hydroxytryptamine receptor 4
LigandBDBM50398964
Substrate/Competitorn/a
Meas. Tech.ChEMBL_875039 (CHEMBL2184357)
Ki 0.794±n/a nM
Citation Furlotti, GAlisi, MAApicella, CCapezzone de Joannon, ACazzolla, NCosti, RCuzzucoli Crucitti, GGarrone, BIacovo, AMagarò, GMangano, GMiele, GOmbrato, RPescatori, LPolenzani, LRosi, FVitiello, MDi Santo, R Discovery and pharmacological profile of new 1H-indazole-3-carboxamide and 2H-pyrrolo[3,4-c]quinoline derivatives as selective serotonin 4 receptor ligands. J Med Chem55:9446-66 (2012) 
 
5-hydroxytryptamine receptor 4
Name:5-hydroxytryptamine receptor 4
Type:Enzyme
Mol. Mass.:43767.54
Organism:Homo sapiens (Human)
Description:Q13639
Residue:388
BDBM50398964
NameBDBM50398964
Synonyms:CHEMBL2179707
TypeSmall organic molecule
Emp. Form.C26H32N4O3
Mol. Mass.448.5573
SMILESCC(C)n1nc(C(=O)NCC2CCN(CCc3ccc(cc3)C(O)=O)CC2)c2ccccc12