Reaction Details
Target5-hydroxytryptamine receptor 4
LigandBDBM50398977
Substrate/Competitorn/a
Meas. Tech.ChEMBL_875039 (CHEMBL2184357)
Ki 1.26±n/a nM
Citation Furlotti, GAlisi, MAApicella, CCapezzone de Joannon, ACazzolla, NCosti, RCuzzucoli Crucitti, GGarrone, BIacovo, AMagarò, GMangano, GMiele, GOmbrato, RPescatori, LPolenzani, LRosi, FVitiello, MDi Santo, R Discovery and pharmacological profile of new 1H-indazole-3-carboxamide and 2H-pyrrolo[3,4-c]quinoline derivatives as selective serotonin 4 receptor ligands. J Med Chem55:9446-66 (2012) 
 
5-hydroxytryptamine receptor 4
Name:5-hydroxytryptamine receptor 4
Type:Enzyme
Mol. Mass.:43767.54
Organism:Homo sapiens (Human)
Description:Q13639
Residue:388
BDBM50398977
NameBDBM50398977
Synonyms:CHEMBL2179705
TypeSmall organic molecule
Emp. Form.C25H31N5O3
Mol. Mass.449.5453
SMILESCC(C)n1nc(C(=O)NCC2CCN(CCc3ccc(cc3)[N+]([O-])=O)CC2)c2ccccc12