Reaction Details
TargetC-X-C chemokine receptor type 4
LigandBDBM50398989
Substrate/Competitorn/a
Meas. Tech.ChEMBL_875045 (CHEMBL2184363)
EC50>100000±n/a nM
Citation Mungalpara, JThiele, SEriksen, ØEksteen, JRosenkilde, MMVåbenø, J Rational design of conformationally constrained cyclopentapeptide antagonists for C-x-C chemokine receptor 4 (CXCR4). J Med Chem55:10287-91 (2012) 
 
C-X-C chemokine receptor type 4
Name:C-X-C chemokine receptor type 4
Type:Enzyme
Mol. Mass.:39754.61
Organism:Homo sapiens (Human)
Description:P61073
Residue:352
BDBM50398989
NameBDBM50398989
Synonyms:CHEMBL2179710
TypeSmall organic molecule
Emp. Form.C36H45N9O8
Mol. Mass.731.798
SMILESNC(=O)NCCC[C@@H]1NC(=O)[C@H](CCCNC(N)=O)NC(=O)[C@@H](Cc2ccc(O)cc2)NC(=O)CNC(=O)[C@H](Cc2ccc3ccccc3c2)NC1=O