Reaction Details
TargetCytochrome P450 2D6
LigandBDBM50399007
Substrate/Competitorn/a
Meas. Tech.ChEMBL_876027 (CHEMBL2182318)
IC50 2000±n/a nM
Citation Wong, JCTang, GWu, XLiang, CZhang, ZGuo, LPeng, ZZhang, WLin, XWang, ZMei, JChen, JPan, SZhang, NLiu, YZhou, MFeng, LZhao, WLi, SZhang, CZhang, MRong, YJin, TGZhang, XRen, SJi, YZhao, RShe, JRen, YXu, CChen, DCai, JShan, SPan, DNing, ZLu, XChen, THe, YChen, L Pharmacokinetic optimization of class-selective histone deacetylase inhibitors and identification of associated candidate predictive biomarkers of hepatocellular carcinoma tumor response. J Med Chem55:8903-25 (2012) 
 
Cytochrome P450 2D6
Name:Cytochrome P450 2D6
Type:Protein
Mol. Mass.:55774.82
Organism:Homo sapiens (Human)
Description:P10635
Residue:497
BDBM50399007
NameBDBM50399007
Synonyms:CHEMBL2178221
TypeSmall organic molecule
Emp. Form.C28H29ClN4O3
Mol. Mass.505.008
SMILESNc1ccccc1NC(=O)\C=C\c1ccc(cc1)[C@H]1CN(CCO)C[C@@H]1C(=O)Nc1ccc(Cl)cc1