Reaction Details
TargetHistone deacetylase 3
LigandBDBM50399005
Substrate/Competitorn/a
Meas. Tech.ChEMBL_874013 (CHEMBL2186138)
IC50 200±n/a nM
Citation Wong, JCTang, GWu, XLiang, CZhang, ZGuo, LPeng, ZZhang, WLin, XWang, ZMei, JChen, JPan, SZhang, NLiu, YZhou, MFeng, LZhao, WLi, SZhang, CZhang, MRong, YJin, TGZhang, XRen, SJi, YZhao, RShe, JRen, YXu, CChen, DCai, JShan, SPan, DNing, ZLu, XChen, THe, YChen, L Pharmacokinetic optimization of class-selective histone deacetylase inhibitors and identification of associated candidate predictive biomarkers of hepatocellular carcinoma tumor response. J Med Chem55:8903-25 (2012) 
 
Histone deacetylase 3
Name:Histone deacetylase 3
Type:Enzyme
Mol. Mass.:48829.55
Organism:Homo sapiens (Human)
Description:O15379
Residue:428
BDBM50399005
NameBDBM50399005
Synonyms:CHEMBL2177588
TypeSmall organic molecule
Emp. Form.C27H27ClN4O2
Mol. Mass.474.982
SMILESCN1C[C@H]([C@@H](C1)c1ccc(\C=C\C(=O)Nc2ccccc2N)cc1)C(=O)Nc1ccc(Cl)cc1