Reaction Details
TargetTyrosine-protein kinase JAK2
LigandBDBM50399020
Substrate/Competitorn/a
Meas. Tech.ChEMBL_874070 (CHEMBL2186603)
IC50 34.5±n/a nM
Citation Hanan, EJvan Abbema, ABarrett, KBlair, WSBlaney, JChang, CEigenbrot, CFlynn, SGibbons, PHurley, CAKenny, JRKulagowski, JLee, LMagnuson, SRMorris, CMurray, JPastor, RMRawson, TSiu, MUltsch, MZhou, ASampath, DLyssikatos, JP Discovery of potent and selective pyrazolopyrimidine janus kinase 2 inhibitors. J Med Chem55:10090-107 (2012) 
 
Tyrosine-protein kinase JAK2
Name:Tyrosine-protein kinase JAK2
Type:Protein
Mol. Mass.:130684.68
Organism:Homo sapiens (Human)
Description:O60674
Residue:1132
BDBM50399020
NameBDBM50399020
Synonyms:CHEMBL2178800
TypeSmall organic molecule
Emp. Form.C18H15ClN6O
Mol. Mass.366.804
SMILESCc1ccc(Cl)cc1-c1nn(C)cc1NC(=O)c1cnn2cccnc12