Reaction Details
TargetTyrosine-protein kinase JAK2
LigandBDBM50399014
Substrate/Competitorn/a
Meas. Tech.ChEMBL_874063 (CHEMBL2186596)
Ki 0.1±n/a nM
Citation Hanan, EJvan Abbema, ABarrett, KBlair, WSBlaney, JChang, CEigenbrot, CFlynn, SGibbons, PHurley, CAKenny, JRKulagowski, JLee, LMagnuson, SRMorris, CMurray, JPastor, RMRawson, TSiu, MUltsch, MZhou, ASampath, DLyssikatos, JP Discovery of potent and selective pyrazolopyrimidine janus kinase 2 inhibitors. J Med Chem55:10090-107 (2012) 
 
Tyrosine-protein kinase JAK2
Name:Tyrosine-protein kinase JAK2
Type:Protein
Mol. Mass.:130684.68
Organism:Homo sapiens (Human)
Description:O60674
Residue:1132
BDBM50399014
NameBDBM50399014
Synonyms:CHEMBL2178805
TypeSmall organic molecule
Emp. Form.C18H16ClN7O
Mol. Mass.381.819
SMILESCc1ccc(Cl)cc1-c1nn(C)cc1NC(=O)c1cnn2ccc(N)nc12