Reaction Details
TargetTyrosine-protein kinase JAK2
LigandBDBM50399018
Substrate/Competitorn/a
Meas. Tech.ChEMBL_874063 (CHEMBL2186596)
Ki 5.2±n/a nM
Citation Hanan, EJvan Abbema, ABarrett, KBlair, WSBlaney, JChang, CEigenbrot, CFlynn, SGibbons, PHurley, CAKenny, JRKulagowski, JLee, LMagnuson, SRMorris, CMurray, JPastor, RMRawson, TSiu, MUltsch, MZhou, ASampath, DLyssikatos, JP Discovery of potent and selective pyrazolopyrimidine janus kinase 2 inhibitors. J Med Chem55:10090-107 (2012) 
 
Tyrosine-protein kinase JAK2
Name:Tyrosine-protein kinase JAK2
Type:Protein
Mol. Mass.:130684.68
Organism:Homo sapiens (Human)
Description:O60674
Residue:1132
BDBM50399018
NameBDBM50399018
Synonyms:CHEMBL2177122
TypeSmall organic molecule
Emp. Form.C17H12Cl2N6O
Mol. Mass.387.223
SMILESCn1cc(NC(=O)c2cnn3cccnc23)c(n1)-c1c(Cl)cccc1Cl