Reaction Details
TargetTyrosine-protein kinase JAK2
LigandBDBM50399026
Substrate/Competitorn/a
Meas. Tech.ChEMBL_874063 (CHEMBL2186596)
Ki 41.1±n/a nM
Citation Hanan, EJvan Abbema, ABarrett, KBlair, WSBlaney, JChang, CEigenbrot, CFlynn, SGibbons, PHurley, CAKenny, JRKulagowski, JLee, LMagnuson, SRMorris, CMurray, JPastor, RMRawson, TSiu, MUltsch, MZhou, ASampath, DLyssikatos, JP Discovery of potent and selective pyrazolopyrimidine janus kinase 2 inhibitors. J Med Chem55:10090-107 (2012) 
 
Tyrosine-protein kinase JAK2
Name:Tyrosine-protein kinase JAK2
Type:Protein
Mol. Mass.:130684.68
Organism:Homo sapiens (Human)
Description:O60674
Residue:1132
BDBM50399026
NameBDBM50399026
Synonyms:CHEMBL2178262
TypeSmall organic molecule
Emp. Form.C19H17ClN6O3
Mol. Mass.412.83
SMILESOC[C@H](O)Cn1cc(NC(=O)c2cnn3cccnc23)c(n1)-c1cccc(Cl)c1