Reaction Details
TargetTyrosine-protein kinase JAK2
LigandBDBM50399038
Substrate/Competitorn/a
Meas. Tech.ChEMBL_874063 (CHEMBL2186596)
Ki 11.9±n/a nM
Citation Hanan, EJvan Abbema, ABarrett, KBlair, WSBlaney, JChang, CEigenbrot, CFlynn, SGibbons, PHurley, CAKenny, JRKulagowski, JLee, LMagnuson, SRMorris, CMurray, JPastor, RMRawson, TSiu, MUltsch, MZhou, ASampath, DLyssikatos, JP Discovery of potent and selective pyrazolopyrimidine janus kinase 2 inhibitors. J Med Chem55:10090-107 (2012) 
 
Tyrosine-protein kinase JAK2
Name:Tyrosine-protein kinase JAK2
Type:Protein
Mol. Mass.:130684.68
Organism:Homo sapiens (Human)
Description:O60674
Residue:1132
BDBM50399038
NameBDBM50399038
Synonyms:CHEMBL2178806
TypeSmall organic molecule
Emp. Form.C17H13ClN6O
Mol. Mass.352.778
SMILESCc1cc(NC(=O)c2cnn3cccnc23)n(n1)-c1cccc(Cl)c1