Reaction Details
TargetNT-3 growth factor receptor
LigandBDBM50399015
Substrate/Competitorn/a
Meas. Tech.ChEMBL_874028 (CHEMBL2186153)
IC50 1300±n/a nM
Citation Hanan, EJvan Abbema, ABarrett, KBlair, WSBlaney, JChang, CEigenbrot, CFlynn, SGibbons, PHurley, CAKenny, JRKulagowski, JLee, LMagnuson, SRMorris, CMurray, JPastor, RMRawson, TSiu, MUltsch, MZhou, ASampath, DLyssikatos, JP Discovery of potent and selective pyrazolopyrimidine janus kinase 2 inhibitors. J Med Chem55:10090-107 (2012) 
 
NT-3 growth factor receptor
Name:NT-3 growth factor receptor
Type:Enzyme
Mol. Mass.:94428.15
Organism:Homo sapiens (Human)
Description:Q16288
Residue:839
BDBM50399015
NameBDBM50399015
Synonyms:CHEMBL2178804
TypeSmall organic molecule
Emp. Form.C17H13Cl2N7O
Mol. Mass.402.237
SMILESCn1cc(NC(=O)c2cnn3ccc(N)nc23)c(n1)-c1cc(Cl)ccc1Cl