Reaction Details
TargetCytochrome P450 2C19
LigandBDBM50399036
Substrate/Competitorn/a
Meas. Tech.ChEMBL_874040 (CHEMBL2186165)
IC50>10000±n/a nM
Citation Hanan, EJvan Abbema, ABarrett, KBlair, WSBlaney, JChang, CEigenbrot, CFlynn, SGibbons, PHurley, CAKenny, JRKulagowski, JLee, LMagnuson, SRMorris, CMurray, JPastor, RMRawson, TSiu, MUltsch, MZhou, ASampath, DLyssikatos, JP Discovery of potent and selective pyrazolopyrimidine janus kinase 2 inhibitors. J Med Chem55:10090-107 (2012) 
 
Cytochrome P450 2C19
Name:Cytochrome P450 2C19
Type:Enzyme
Mol. Mass.:55935.47
Organism:Homo sapiens (Human)
Description:P33261
Residue:490
BDBM50399036
NameBDBM50399036
Synonyms:CHEMBL2178247
TypeSmall organic molecule
Emp. Form.C18H16ClN7O
Mol. Mass.381.819
SMILESCNc1ccn2ncc(C(=O)Nc3cc(C)nn3-c3cccc(Cl)c3)c2n1