Reaction Details
TargetCytochrome P450 3A4
LigandBDBM50399011
Substrate/Competitorn/a
Meas. Tech.ChEMBL_874073 (CHEMBL2186606)
IC50>10000±n/a nM
Citation Hanan, EJvan Abbema, ABarrett, KBlair, WSBlaney, JChang, CEigenbrot, CFlynn, SGibbons, PHurley, CAKenny, JRKulagowski, JLee, LMagnuson, SRMorris, CMurray, JPastor, RMRawson, TSiu, MUltsch, MZhou, ASampath, DLyssikatos, JP Discovery of potent and selective pyrazolopyrimidine janus kinase 2 inhibitors. J Med Chem55:10090-107 (2012) 
 
Cytochrome P450 3A4
Name:Cytochrome P450 3A4
Type:Enzyme
Mol. Mass.:57349.57
Organism:Homo sapiens (Human)
Description:n/a
Residue:503
BDBM50399011
NameBDBM50399011
Synonyms:CHEMBL2178251
TypeSmall organic molecule
Emp. Form.C17H13ClN6O
Mol. Mass.352.778
SMILESCn1cc(c(NC(=O)c2cnn3cccnc23)n1)-c1cccc(Cl)c1