Reaction Details
TargetCytochrome P450 1A2
LigandBDBM50399009
Substrate/Competitorn/a
Meas. Tech.ChEMBL_874066 (CHEMBL2186599)
IC50>10000±n/a nM
Citation Hanan, EJvan Abbema, ABarrett, KBlair, WSBlaney, JChang, CEigenbrot, CFlynn, SGibbons, PHurley, CAKenny, JRKulagowski, JLee, LMagnuson, SRMorris, CMurray, JPastor, RMRawson, TSiu, MUltsch, MZhou, ASampath, DLyssikatos, JP Discovery of potent and selective pyrazolopyrimidine janus kinase 2 inhibitors. J Med Chem55:10090-107 (2012) 
 
Cytochrome P450 1A2
Name:Cytochrome P450 1A2
Type:Enzyme
Mol. Mass.:58423.38
Organism:Homo sapiens (Human)
Description:P05177
Residue:516
BDBM50399009
NameBDBM50399009
Synonyms:CHEMBL2178254
TypeSmall organic molecule
Emp. Form.C17H14ClN7O
Mol. Mass.367.792
SMILESCn1cc(NC(=O)c2cnn3ccc(N)nc23)c(n1)-c1cccc(Cl)c1