Reaction Details
TargetMacrophage migration inhibitory factor
LigandBDBM50399046
Substrate/Competitorn/a
Meas. Tech.ChEMBL_878773 (CHEMBL2183713)
Ki 38±n/a nM
Citation Dahlgren, MKGarcia, ABHare, AATirado-Rives, JLeng, LBucala, RJorgensen, WL Virtual screening and optimization yield low-nanomolar inhibitors of the tautomerase activity of Plasmodium falciparum macrophage migration inhibitory factor. J Med Chem55:10148-59 (2012) 
 
Macrophage migration inhibitory factor
Name:Macrophage migration inhibitory factor
Synonyms:Macrophage migration inhibitory factor (MIF)
Type:Enzyme
Mol. Mass.:12844.38
Organism:Plasmodium falciparum
Description:Q6Q3H7
Residue:116
BDBM50399046
NameBDBM50399046
Synonyms:CHEMBL2178862
TypeSmall organic molecule
Emp. Form.C21H21NO3
Mol. Mass.335.3963
SMILESCOc1ccc(cc1)-c1cc(Oc2cc(C)cc(OC)c2)cc(C)n1