Reaction Details
TargetMacrophage migration inhibitory factor
LigandBDBM50399051
Substrate/Competitorn/a
Meas. Tech.ChEMBL_878773 (CHEMBL2183713)
Ki 1600±n/a nM
Citation Dahlgren, MKGarcia, ABHare, AATirado-Rives, JLeng, LBucala, RJorgensen, WL Virtual screening and optimization yield low-nanomolar inhibitors of the tautomerase activity of Plasmodium falciparum macrophage migration inhibitory factor. J Med Chem55:10148-59 (2012) 
 
Macrophage migration inhibitory factor
Name:Macrophage migration inhibitory factor
Synonyms:Macrophage migration inhibitory factor (MIF)
Type:Enzyme
Mol. Mass.:12844.38
Organism:Plasmodium falciparum
Description:Q6Q3H7
Residue:116
BDBM50399051
NameBDBM50399051
Synonyms:CHEMBL2178855
TypeSmall organic molecule
Emp. Form.C18H13N3O
Mol. Mass.287.3153
SMILESCc1cc(Oc2cccc(c2)C#N)nc(n1)-c1ccccc1