Reaction Details
TargetMacrophage migration inhibitory factor
LigandBDBM50399054
Substrate/Competitorn/a
Meas. Tech.ChEMBL_878773 (CHEMBL2183713)
Ki 43±n/a nM
Citation Dahlgren, MKGarcia, ABHare, AATirado-Rives, JLeng, LBucala, RJorgensen, WL Virtual screening and optimization yield low-nanomolar inhibitors of the tautomerase activity of Plasmodium falciparum macrophage migration inhibitory factor. J Med Chem55:10148-59 (2012) 
 
Macrophage migration inhibitory factor
Name:Macrophage migration inhibitory factor
Synonyms:Macrophage migration inhibitory factor (MIF)
Type:Enzyme
Mol. Mass.:12844.38
Organism:Plasmodium falciparum
Description:Q6Q3H7
Residue:116
BDBM50399054
NameBDBM50399054
Synonyms:CHEMBL2178851
TypeSmall organic molecule
Emp. Form.C17H20N2O3
Mol. Mass.300.3523
SMILESCOc1cccc(Oc2cc(C)nc(c2)N2CCOCC2)c1