Reaction Details
TargetCarbonic anhydrase 5A, mitochondrial
LigandBDBM50399077
Substrate/Competitorn/a
Meas. Tech.ChEMBL_878785 (CHEMBL2183725)
Ki 327±n/a nM
Citation Marini, AMMaresca, AAggarwal, MOrlandini, ENencetti, SDa Settimo, FSalerno, SSimorini, FLa Motta, CTaliani, SNuti, EScozzafava, AMcKenna, RRossello, ASupuran, CT Tricyclic sulfonamides incorporating benzothiopyrano[4,3-c]pyrazole and pyridothiopyrano[4,3-c]pyrazole effectively inhibita- andß-carbonic anhydrase: X-ray crystallography and solution investigations on 15 isoforms. J Med Chem55:9619-29 (2012) 
 
Carbonic anhydrase 5A, mitochondrial
Name:Carbonic anhydrase 5A, mitochondrial
Type:Enzyme
Mol. Mass.:34755.54
Organism:Homo sapiens (Human)
Description:Human (cloned) isozyme
Residue:305
BDBM50399077
NameBDBM50399077
Synonyms:CHEMBL2179306
TypeSmall organic molecule
Emp. Form.C17H12F3N3O2S2
Mol. Mass.411.421
SMILESNS(=O)(=O)c1ccc(cc1)-n1ncc2CSc3cc(ccc3-c12)C(F)(F)F