Reaction Details
TargetCarbonic anhydrase 12
LigandBDBM50399078
Substrate/Competitorn/a
Meas. Tech.ChEMBL_878781 (CHEMBL2183721)
Ki 5620±n/a nM
Citation Marini, AMMaresca, AAggarwal, MOrlandini, ENencetti, SDa Settimo, FSalerno, SSimorini, FLa Motta, CTaliani, SNuti, EScozzafava, AMcKenna, RRossello, ASupuran, CT Tricyclic sulfonamides incorporating benzothiopyrano[4,3-c]pyrazole and pyridothiopyrano[4,3-c]pyrazole effectively inhibita- andß-carbonic anhydrase: X-ray crystallography and solution investigations on 15 isoforms. J Med Chem55:9619-29 (2012) 
 
Carbonic anhydrase 12
Name:Carbonic anhydrase 12
Type:Enzyme
Mol. Mass.:39456.00
Organism:Homo sapiens (Human)
Description:Catalytic domain of human cloned isozyme was used in the assay
Residue:354
BDBM50399078
NameBDBM50399078
Synonyms:CHEMBL2179307
TypeSmall organic molecule
Emp. Form.C16H12ClN3O2S2
Mol. Mass.377.868
SMILESNS(=O)(=O)c1ccc(cc1)-n1ncc2CSc3cc(Cl)ccc3-c12