Reaction Details
TargetCannabinoid receptor 2
LigandBDBM50399121
Substrate/Competitorn/a
Meas. Tech.ChEMBL_876706 (CHEMBL2183177)
Ki 22±n/a nM
Citation Yang, PMyint, KZTong, QFeng, RCao, HAlmehizia, AAAlqarni, MHWang, LBartlow, PGao, YGertsch, JTeramachi, JKurihara, NRoodman, GDCheng, TXie, XQ Lead discovery, chemistry optimization, and biological evaluation studies of novel biamide derivatives as CB2 receptor inverse agonists and osteoclast inhibitors. J Med Chem55:9973-87 (2012) 
 
Cannabinoid receptor 2
Name:Cannabinoid receptor 2
Type:G Protein-Coupled Receptor (GPCR)
Mol. Mass.:39690.94
Organism:Homo sapiens (Human)
Description:P34972
Residue:360
BDBM50399121
NameBDBM50399121
Synonyms:CHEMBL2179751
TypeSmall organic molecule
Emp. Form.C29H35N3O2
Mol. Mass.457.6071
SMILESCCCN(CCC)c1ccc(cc1)C(NC(=O)Cc1ccccc1)NC(=O)Cc1ccccc1