Reaction Details
TargetP2X purinoceptor 7
LigandBDBM50399165
Substrate/Competitorn/a
Meas. Tech.ChEMBL_876871 (CHEMBL2184465)
IC50>10000±n/a nM
Citation Hernandez-Olmos, VAbdelrahman, AEl-Tayeb, AFreudendahl, DWeinhausen, SMüller, CE N-substituted phenoxazine and acridone derivatives: structure-activity relationships of potent P2X4 receptor antagonists. J Med Chem55:9576-88 (2012) 
 
P2X purinoceptor 7
Name:P2X purinoceptor 7
Type:Protein
Mol. Mass.:68602.85
Organism:Homo sapiens (Human)
Description:Q99572
Residue:595
BDBM50399165
NameBDBM50399165
Synonyms:CHEMBL2180137
TypeSmall organic molecule
Emp. Form.C20H15NO3
Mol. Mass.317.338
SMILESO=C(OCc1ccccc1)N1c2ccccc2Oc2ccccc12