Reaction Details
TargetP2X purinoceptor 4
LigandBDBM50399186
Substrate/Competitorn/a
Meas. Tech.ChEMBL_876885 (CHEMBL2184479)
IC50 5290±n/a nM
Citation Hernandez-Olmos, VAbdelrahman, AEl-Tayeb, AFreudendahl, DWeinhausen, SMüller, CE N-substituted phenoxazine and acridone derivatives: structure-activity relationships of potent P2X4 receptor antagonists. J Med Chem55:9576-88 (2012) 
 
P2X purinoceptor 4
Name:P2X purinoceptor 4
Type:Enzyme Catalytic Domain
Mol. Mass.:43374.70
Organism:Homo sapiens (Human)
Description:Purinergic, P2X4 0 HUMAN::Q99571
Residue:388
BDBM50399186
NameBDBM50399186
Synonyms:CHEMBL2180185
TypeSmall organic molecule
Emp. Form.C19H12ClNO2
Mol. Mass.321.757
SMILESClc1ccc(cc1)C(=O)N1c2ccccc2Oc2ccccc12