Reaction Details
TargetP2X purinoceptor 4
LigandBDBM50399175
Substrate/Competitorn/a
Meas. Tech.ChEMBL_876875 (CHEMBL2184469)
IC50>10000±n/a nM
Citation Hernandez-Olmos, VAbdelrahman, AEl-Tayeb, AFreudendahl, DWeinhausen, SMüller, CE N-substituted phenoxazine and acridone derivatives: structure-activity relationships of potent P2X4 receptor antagonists. J Med Chem55:9576-88 (2012) 
 
P2X purinoceptor 4
Name:P2X purinoceptor 4
Type:PROTEIN
Mol. Mass.:43443.55
Organism:Mus musculus
Description:ChEMBL_1283887
Residue:388
BDBM50399175
NameBDBM50399175
Synonyms:CHEMBL2180171
TypeSmall organic molecule
Emp. Form.C21H18N2O2
Mol. Mass.330.3798
SMILESO=C(NCCc1ccccc1)N1c2ccccc2Oc2ccccc12