Reaction Details
TargetP2X purinoceptor 4
LigandBDBM50399183
Substrate/Competitorn/a
Meas. Tech.ChEMBL_876876 (CHEMBL2184470)
IC50 928±n/a nM
Citation Hernandez-Olmos, VAbdelrahman, AEl-Tayeb, AFreudendahl, DWeinhausen, SMüller, CE N-substituted phenoxazine and acridone derivatives: structure-activity relationships of potent P2X4 receptor antagonists. J Med Chem55:9576-88 (2012) 
 
P2X purinoceptor 4
Name:P2X purinoceptor 4
Type:Enzyme Catalytic Domain
Mol. Mass.:43504.16
Organism:RAT
Description:Purinergic, P2X4 0 RAT::P51577
Residue:388
BDBM50399183
NameBDBM50399183
Synonyms:CHEMBL2180160
TypeSmall organic molecule
Emp. Form.C19H15NO3S
Mol. Mass.337.392
SMILESCc1ccc(cc1)S(=O)(=O)N1c2ccccc2Oc2ccccc12