Reaction Details
TargetPotassium voltage-gated channel subfamily H member 2
LigandBDBM50399295
Substrate/Competitorn/a
Meas. Tech.ChEMBL_877119 (CHEMBL2187242)
IC50 1290±n/a nM
Citation Zanaletti, RBettinetti, LCastaldo, CCeccarelli, ICocconcelli, GComery, TADunlop, JGenesio, EGhiron, CHaydar, SNJow, FMaccari, LMicco, INencini, APratelli, CScali, CTurlizzi, EValacchi, M N-[5-(5-fluoropyridin-3-yl)-1H-pyrazol-3-yl]-4-piperidin-1-ylbutyramide (SEN78702, WYE-308775): a medicinal chemistry effort toward ana7 nicotinic acetylcholine receptor agonist preclinical candidate. J Med Chem55:10277-81 (2012) 
 
Potassium voltage-gated channel subfamily H member 2
Name:Potassium voltage-gated channel subfamily H member 2
Type:Multi-pass membrane protein
Mol. Mass.:126672.65
Organism:Homo sapiens (Human)
Description:Q12809
Residue:1159
BDBM50399295
NameBDBM50399295
Synonyms:CHEMBL2180841
TypeSmall organic molecule
Emp. Form.C18H23FN4O
Mol. Mass.330.3998
SMILESFc1cccc(c1)-c1cc(NC(=O)CCCN2CCCCC2)[nH]n1